{"text_format":"1","workbook":"xlsx","n_sheets":3,"sheets":["Data","Statistical analysis","s.e."],"not_rendered":{"charts":1,"images":0,"macros":1,"external_links":0,"defined_names":66,"comments":0,"pivot_tables":0},"unopened":[],"bounds":{"document_bytes":16777216,"sheet_cells":100000,"rows_first":2000,"rows_last":500,"rows_between":2000,"halvings":0,"cell_chars":16384,"cell_head_chars":4096},"cells_cut":0,"cells_raw":0,"read":"whole","date_system":"1900"}

{"sheet":"Data","index":0,"n_rows":122,"n_cols":27,"rows_kept":122,"cut":false,"hidden":false,"merged":[[6,12,6,13],[7,12,7,13],[1,2,1,7],[2,2,2,7],[3,2,3,7],[4,2,4,7],[6,19,6,22],[6,2,6,4],[6,6,6,8],[5,2,5,6],[6,15,6,16]]}
["mean(Time)",{"$f":"SUMPRODUCT(B10:B122,C10:C122)/g","v":84.901098901098905},"Initial values of the parameters"]
["s.d. (Time)",{"$f":"SQRT((SUMPRODUCT(B10:B122^2,C10:C122)-g*B1^2)/(g-1))","v":20.097017437672392},"g: the probability of a seed germinating",null,null,null,null,null,{"$f":"IF(N=\"\",\"\",g/N)","v":0.91}]
["last time",{"$f":"MAX($B$10:$B$122)","v":168},"l: an index of the duration of germination",null,null,null,null,null,{"$f":"1/(SUMPRODUCT(N10:N122,C10:C122)/g-1/$I$4)","v":44.302310107488175}]
["# seeds germinated",{"$f":"SUM(C$10:C122)","v":91},"m: the mean time to germination after the lag",null,null,null,null,null,{"$f":"mean-$I$5","v":32.201098901098902},null,null,null,null,null,null,null,null,null,{"$f":"SUM(T9,S10:S122)","v":100}]
[null,null,"t: the lag (delay in germination)",null,null,null,null,null,{"$f":"0.9*OFFSET($B$10,MATCH(0.5,$G$10:$G$122,1),0)+0.1*OFFSET($B$10,MATCH(0.5,$G$10:$G$122,1)-1,0)","v":52.7}]
["G(tk)",{"$f":"VLOOKUP(Tmax,$B$10:$I$122,8)","v":0.90999999999999992}]
[null,null,"individual proportions",null,null,null,"cumulative proportions",null,null,null,null,null,"Initial value ",null,null,"data for plot",null,null,null,"Deviance calculations - for seeds which have germinated",null,null,null,"based on all seeds",null,{"$f":"SUM(Z10:Z122)","v":0.98057147953418222},"sum"]
[null,"Time","ni","observed","expected",null,"Ni","observed","expected",null,"Log-Likelihood",null,"calculations",null,null,"x","y",null,"E(ni)","contracting E(ni)","ni","ni Log(ni/(Nk pi) )",null,"ni Log(ni/(Nk pi) )",null,"Unconditional probabilites"]
[null,"# seeds ungerminated",{"$f":"IF(N=\"\",\"unknown\",N-g)","v":9},{"$f":"IF(g_not=\"unknown\",\"\",g_not/N)","v":0.09},{"$f":"IF(g_not=\"unknown\",\"\",1-SUM(E10:E122))","v":9.000000000000008E-2},null,null,null,null,null,{"$f":"IF($C9=\"unknown\",\"\",IF(C9=0,0,LN(E9)*C9))","v":-21.671510477866839},null,null,null,null,"incr.",{"$f":"(Tmax-lag)/100","v":1.153},null,null,{"$f":"IF(N=\"\",\"\",N*E9)","v":9.0000000000000071},{"$f":"IF(N=\"\",\"\",g_not)","v":9},{"$f":"IF(N=\"\",\"\",IF(p<1,0,U9*LN(U9/T9)))","v":0},null,{"$f":"IF($C9=\"unknown\",\"\",IF($C9=0,0,$C9*LN(C9/E9/N)))","v":-7.9936057773011302E-15}]
[null,32,0,{"$f":"IF(B10=\"\",\"\",C10/IF(N=\"\",g,N))","v":0},{"$f":"IF(B10=\"\",\"\",IF(N=\"\",Z10/$Z$7,Z10*p))","v":0},null,{"$f":"C10","v":0},{"$f":"D10","v":0},{"$f":"E10","v":0},null,{"$f":"IF($B10=\"\",\"\",IF(E10=0,0,LN(E10)*C10))","v":0},null,null,null,null,0,{"$f":"lag","v":52.7},null,{"$f":"IF(B10=\"\",\"\",IF(N=\"\",g*E10,N*E10))","v":0},null,null,null,null,{"$f":"IF($B10=\"\",\"\",IF($C10=0,0,$C10*LN($C10/E10/IF(N=\"\",g,N))))","v":0},null,{"$f":"IF(B10=\"\",\"\",IG(lag,Data!$B10,Mu,lag,scale))","v":0}]
[null,55,1,{"$f":"IF(B11=\"\",\"\",C11/IF(N=\"\",g,N))","v":0.01},4.0019421012000555E-5,null,{"$f":"IF(B11=\"\",\"\",G10+C11)","v":1},{"$f":"IF(C11=\"\",\"\",H10+D11)","v":0.01},{"$f":"IF(D11=\"\",\"\",I10+E11)","v":4.0019421012000555E-5},null,{"$f":"IF($B11=\"\",\"\",IF(E11=0,0,LN(E11)*C11))","v":-10.126145696379595},null,{"$f":"IF(B11=\"\",\"\",AVERAGE(B10:B11))","v":43.5},{"$f":"IF(B11=\"\",\"\",IF(M11<$I$5,\"\",1/(M11-$I$5)))","v":""},null,{"$f":"g*IG(lag,Q11,Mu,lag,scale)/$Z$7","v":2.0431389500145412E-7},{"$f":"Q10+incr","v":53.853000000000002},null,{"$f":"IF(B11=\"\",\"\",IF(N=\"\",g*E11,N*E11))","v":4.0019421012000558E-3},{"$f":"IF(B11=\"\",\"\",IF(SUM($S$10:$S11)<1,\"\",IF(SUM($S$10:$S10)<1,SUM($S$10:$S11),IF(SUM(T$10:T10)=g,\"\",IF(S12<1,g-SUM($S$10:$S10),S11)))))","v":""},{"$f":"IF(T11=\"\",\"\",IF(T10=\"\",SUM(C$10:C11),IF(T12=\"\",g-SUM(C$10:C10),C11)))","v":""},{"$f":"IF($B11=\"\",\"\",IF($U11=\"\",\"\",IF($U11=0,0,$U11*LN($U11/T11))))","v":""},null,{"$f":"IF($B11=\"\",\"\",IF($C11=0,0,$C11*LN($C11/E11/IF(N=\"\",g,N))))","v":5.5209755103915032},null,{"$f":"IF(B11=\"\",\"\",IG(Data!$B10,Data!$B11,Mu,lag,scale))","v":4.3122970188833769E-5}]
[null,62,7,7.0000000000000007E-2,9.1612239939664081E-2,null,{"$f":"IF(B12=\"\",\"\",G11+C12)","v":8},{"$f":"IF(C12=\"\",\"\",H11+D12)","v":0.08},{"$f":"IF(D12=\"\",\"\",I11+E12)","v":9.1652259360676086E-2},null,-16.731332747034202,null,58.5,{"$f":"IF(B12=\"\",\"\",IF(M12<$I$5,\"\",1/(M12-$I$5)))","v":0.17241379310344837},null,{"$f":"P11+g*IG(Q11,Q12,Mu,lag,scale)/$Z$7","v":4.1079464343448989E-3},{"$f":"Q11+incr","v":55.006},null,9.1612239939664075,{"$f":"IF(B12=\"\",\"\",IF(SUM($S$10:$S12)<1,\"\",IF(SUM($S$10:$S11)<1,SUM($S$10:$S12),IF(SUM(T$10:T11)=g,\"\",IF(S13<1,g-SUM($S$10:$S11),S12)))))","v":9.1652259360676069},{"$f":"IF(T12=\"\",\"\",IF(T11=\"\",SUM(C$10:C12),IF(T13=\"\",g-SUM(C$10:C11),C12)))","v":8},-1.0877999308894291,null,-1.8834875114952456,null,{"$f":"IF(B12=\"\",\"\",IG(Data!$B11,Data!$B12,Mu,lag,scale))","v":9.8716867759425175E-2}]
[null,72,27,0.27,0.27256320009234342,null,35,0.35000000000000003,0.36421545945301947,null,-35.096888650284583,null,67,6.9930069930069949E-2,null,0.1187802440459443,56.158999999999999,null,27.25632000923434,{"$f":"IF(B13=\"\",\"\",IF(SUM($S$10:$S13)<1,\"\",IF(SUM($S$10:$S12)<1,SUM($S$10:$S13),IF(SUM(T$10:T12)=g,\"\",IF(S14<1,g-SUM($S$10:$S12),S13)))))","v":27.25632000923434},{"$f":"IF(T13=\"\",\"\",IF(T12=\"\",SUM(C$10:C13),IF(T14=\"\",g-SUM(C$10:C12),C13)))","v":27},-0.25511098927700143,null,-0.25511098927700143,null,{"$f":"IF(B13=\"\",\"\",IG(Data!$B12,Data!$B13,Mu,lag,scale))","v":0.29370076964958303}]
[null,79,22,0.22,0.14617217318401679,null,57,0.57000000000000006,0.51038763263703624,null,-42.305341840979978,null,75.5,4.3859649122807022E-2,null,0.65487774979649904,57.311999999999998,null,14.617217318401678,{"$f":"IF(B14=\"\",\"\",IF(SUM($S$10:$S14)<1,\"\",IF(SUM($S$10:$S13)<1,SUM($S$10:$S14),IF(SUM(T$10:T13)=g,\"\",IF(S15<1,g-SUM($S$10:$S13),S14)))))","v":14.617217318401678},{"$f":"IF(T14=\"\",\"\",IF(T13=\"\",SUM(C$10:C14),IF(T15=\"\",g-SUM(C$10:C13),C14)))","v":22},8.9945317231249167,null,8.9945317231249167,null,{"$f":"IF(B14=\"\",\"\",IG(Data!$B13,Data!$B14,Mu,lag,scale))","v":0.15750798255580006}]
[null,86,8,0.08,0.10607233646205641,null,65,0.65,0.61645996909909262,null,-17.949071985271868,null,82.5,3.3557046979865772E-2,null,1.8467909651940815,58.464999999999996,null,10.607233646205641,{"$f":"IF(B15=\"\",\"\",IF(SUM($S$10:$S15)<1,\"\",IF(SUM($S$10:$S14)<1,SUM($S$10:$S15),IF(SUM(T$10:T14)=g,\"\",IF(S16<1,g-SUM($S$10:$S14),S15)))))","v":10.607233646205641},{"$f":"IF(T15=\"\",\"\",IF(T14=\"\",SUM(C$10:C15),IF(T16=\"\",g-SUM(C$10:C14),C15)))","v":8},-2.2567571691941755,null,-2.2567571691941755,null,{"$f":"IF(B15=\"\",\"\",IG(Data!$B14,Data!$B15,Mu,lag,scale))","v":0.11429836033213873}]
{"$rows_left_out":108}
{"sheet":"Statistical analysis","index":1,"n_rows":18,"n_cols":10,"rows_kept":18,"cut":false,"hidden":false,"merged":[[2,0,2,2],[5,0,5,2],[6,0,6,2],[3,0,3,2],[4,0,4,2],[4,5,4,9],[12,0,12,3],[11,0,11,3],[7,0,7,2],[8,0,8,2],[9,0,9,2]]}
[null,100,"The number of seeds used (if known)",null,null,null,null,{"$f":"IF(g_not<0,\"impossible number:\",\"\")","v":""}]
[null,null,null,"estimate","s.e.",null,null,{"$f":"IF(g_not<0,\"check individual counts\",\"\")","v":""}]
["mean time to germination from sowing",null,null,{"$f":"Mu+lag","v":84.901098901098905},{"$f":"s.e.!R6","v":5.6908576617709388}]
["standard deviation of time to germination",null,null,{"$f":"SQRT(Mu^3/scale)","v":27.453192339191801},{"$f":"SQRT(9/4*Mu/scale*$E$9^2+(Mu/scale)^3/4*E8^2-3/2*(Mu/scale)^2*$E$9*$E$8*H8)","v":9.8786042376807313}]
[" time to 50% germination",null,null,{"$f":"VLOOKUP(0.001,s.e.!$W$12:$Y$23,3)","v":76.534668039439623},{"$f":"s.e.!Y8","v":1.9157117565936799},"Correlations between estimates"]
[" number of viable seeds",null,null,{"$f":"IF(N=\"\",g/Data!$Z$7,N*p)","v":92.803025479824569},{"$f":"IF(N=\"\",\"\",$E$7*N)","v":4.0123267598497829},{"$f":"IF(N=\"\",\"\",\"g\")","v":"g"},"l","m","t"]
["g: the probability of a seed germinating",null,null,{"$f":"IF(N=\"\",\"\",MIN(1,g/(N*Data!$Z$7)))","v":0.92803025479824575},{"$f":"IF(N=\"\",\"\",s.e.!R$5)","v":4.0123267598497825E-2},{"$f":"IF(N=\"\",\"\",1)","v":1},{"$f":"s.e.!T5","v":-0.50549506757519103},{"$f":"s.e.!U5","v":0.58983618844301433},{"$f":"s.e.!S5","v":0.35461825062942243},{"$f":"IF(N=\"\",\"\",\"g\")","v":"g"}]
["l: an inverse measure of variance",null,null,{"$f":"Data!I3","v":44.302310107488175},{"$f":"s.e.!R3","v":13.05468597403628},null,{"$f":"s.e.!T3","v":1},{"$f":"s.e.!T4","v":-0.59155561155319614},{"$f":"s.e.!T2","v":-0.79351716545960937},"l"]
["m:  mean time from sowing - lag",null,null,{"$f":"Data!I4","v":32.201098901098902},{"$f":"s.e.!R4","v":5.4205795081570542},null,null,{"$f":"s.e.!U4","v":1},{"$f":"s.e.!U2","v":0.35697066861125071},"m"]
["t: the lag, or delay in germination",null,null,{"$f":"Data!I5","v":52.7},{"$f":"s.e.!R2","v":0.66257959805986444},null,null,null,1,"t"]
[null,null,"likelihood",{"$f":"SUM(Data!K9:K122)","v":-214.91184424117887}]
["Maximise the likelihood in cell D10 by running Tools/Solver"]
["(You will vary l, m and t in cells B7, B8 and B9)"]
[]
[null,null,null,"A guide to whether the Inverse Gaussian model fits"]
{"$rows_left_out":4}
{"sheet":"s.e.","index":2,"n_rows":123,"n_cols":29,"rows_kept":123,"cut":false,"hidden":false,"merged":[[7,13,7,15]]}
[null,null,null,null,null,"Information matrix","lag","l","m","g",null,null,"Inverse of information matrix","lag","l","m","g","s.e.","correlations",null,null,null,null,"IG[t(1)]",{"$f":"IG(lag,Y12,Mu,lag,scale)","v":0.45827992074263796},null,null,"b1",0.31938153000000002]
[null,null,null,null,null,"lag",{"$f":"-1*SUMPRODUCT($C12:$C123,Q12:Q123)+g/Gtk*(G$8-D$8^2/Gtk)","v":6.4917582761974346},{"$f":"-1*SUMPRODUCT($C12:$C123,T12:T123)+g/Gtk*(J$8-D$8*E$8/Gtk)","v":0.29516351516013256},{"$f":"-1*SUMPRODUCT($C12:$C123,U12:U123)+g/Gtk*(K$8-D$8*F$8/Gtk)","v":0.13725127124800479},{"$f":"IF(N=\"\",\"\",N^2*D8/(g_not))","v":-0.66296065724511422},null,null,"lag",{"$f":"MINVERSE(G2:I4)","v":0.43901172376517145},-6.863739849827466,1.2820834992598229,{"$f":"IF(N=\"\",\"\",-1/J5*MMULT(N2:P4,J2:J4))","v":9.4274760209764399E-3},{"$f":"SQRT(N2)","v":0.66257959805986444},{"$f":"N2/SQRT(N$2*$N2)","v":1},{"$f":"O2/SQRT(O$3*$N2)","v":-0.79351716545960937},{"$f":"P2/SQRT(P$4*$N2)","v":0.35697066861125071},{"$f":"IF(N=\"\",\"\",Q2/SQRT(Q$5*$N2))","v":0.35461825062942243},null,"g[t(1)]",{"$f":"PDF(Y12,Mu,lag,scale)","v":2.3291960569951559E-2},null,null,"b2",-0.356563782]
[null,null,null,null,null,"l",{"$f":"H2","v":0.29516351516013256},{"$f":"-1*SUMPRODUCT($C12:$C123,R12:R123)+g/Gtk*(H$8-E$8^2/Gtk)","v":2.2446678763984571E-2},{"$f":"-1*SUMPRODUCT($C12:$C123,V12:V123)+g/Gtk*(L$8-E$8*F$8/Gtk)","v":1.9100097583142715E-2},{"$f":"IF(N=\"\",\"\",N^2*E8/(g_not))","v":0.71836082197175455},null,null,"l",-6.8637398498274651,170.42482588069959,-41.860819571831499,-0.26477662741080082,{"$f":"SQRT(O3)","v":13.05468597403628},{"$f":"T2","v":-0.79351716545960937},{"$f":"O3/SQRT(O$3*$O3)","v":1},{"$f":"P3/SQRT(P$4*$O3)","v":-0.59155561155319614},{"$f":"IF(N=\"\",\"\",Q3/SQRT(Q$5*$O3))","v":-0.50549506757519103},null,"Dlagt(1)",1,null,null,"b3",1.781477937]
[null,null,null,null,null,"m",{"$f":"I2","v":0.13725127124800479},{"$f":"I3","v":1.9100097583142715E-2},{"$f":"-1*SUMPRODUCT($C12:$C123,S12:S123)+g/Gtk*(I$8-F$8^2/Gtk)","v":5.5256294756434857E-2},{"$f":"IF(N=\"\",\"\",N^2*F8/(g_not))","v":-3.3621339450850152},null,null,"m",1.2820834992598233,-41.860819571831513,29.382682204252173,0.12828427606672047,{"$f":"SQRT(P4)","v":5.4205795081570542},{"$f":"U2","v":0.35697066861125071},{"$f":"U3","v":-0.59155561155319614},{"$f":"P4/SQRT(P$4*$P4)","v":1},{"$f":"IF(N=\"\",\"\",Q4/SQRT(Q$5*$P4))","v":0.58983618844301433},null,"D l t(1)",{"$f":"(1-SQRT(2*PI())*(2*f-0.5/f)*ff)/f^2","v":0.2067848747745325},null,null,"b4",-1.8212559779999999]
[null,null,null,null,null,"g",{"$f":"IF(N=\"\",\"\",J2)","v":-0.66296065724511422},{"$f":"IF(N=\"\",\"\",J3)","v":0.71836082197175455},{"$f":"IF(N=\"\",\"\",J4)","v":-3.3621339450850152},{"$f":"IF(N=\"\",\"\",N^3*Gtk^2/(g*g_not))","v":1011.111111111111},null,null,"g",{"$f":"IF(N=\"\",\"\",Q2)","v":9.4274760209764399E-3},{"$f":"IF(N=\"\",\"\",Q3)","v":-0.26477662741080082},{"$f":"IF(N=\"\",\"\",Q4)","v":0.12828427606672047},{"$f":"IF(N=\"\",\"\",1/J5*(1+MMULT(MMULT(G5:I5,N2:P4),J2:J4)/J5))","v":1.6098766027806653E-3},{"$f":"IF(N=\"\",\"\",SQRT(Q5))","v":4.0123267598497825E-2},{"$f":"V2","v":0.35461825062942243},{"$f":"V3","v":-0.50549506757519103},{"$f":"V4","v":0.58983618844301433},{"$f":"IF(N=\"\",\"\",Q5/SQRT(Q$5*$Q5))","v":1},null,"D m t(1)",{"$f":"SQRT(2*PI())*(2*f-1.5/f)*ff","v":0.39772915597021602},null,null,"b5",1.3302744289999999]
[null,null,null,null,null,null,null,null,null,null,null,null,"l+m",null,null,null,null,{"$f":"SQRT(N2+P4+2*P2)","v":5.6908576617709388},null,null,null,null,null,"g'(t(1))",{"$f":"Y2*(-1.5/(Y12-lag)-scale/(2*Mu^2)+scale/2/(Y12-lag)^2)","v":-1.0188809273460324E-3},null,null,"f",{"$f":"SQRT(scale/Mu)","v":1.1729455177104871}]
[null,null,null,null,null,null,null,null,null,null,null,null,"# viable seeds",null,null,null,null,{"$f":"SQRT(MMULT(MMULT(D8:F8,N2:P4),TRANSPOSE(D8:F8)))*g/Gtk","v":2.2674629319189954},null,null,null,null,null,"g''(t(1))",{"$f":"Y6*(-1.5/(Y12-lag)-scale/(2*Mu^2)+scale/2/(Y12-lag)^2)+Y2*(1.5/(Y12-lag)^2-scale/(Y12-lag)^3)","v":1.9635364020235214E-5},null,null,"transformed (-2f)",{"$f":"1/(1+0.2316419*2*f)","v":0.64791738178606462}]
[null,null,"at tmax",{"$f":"VLOOKUP(MAX($B$11:$B$123),$B$11:$F$123,3)","v":-5.966645915206028E-4},{"$f":"VLOOKUP(MAX($B$11:$B$123),$B$11:$F$123,4)","v":6.4652473977457904E-4},{"$f":"VLOOKUP(MAX($B$11:$B$123),$B$11:$F$123,5)","v":-3.0259205505765137E-3},{"$f":"VLOOKUP(MAX($B$11:$B$123),$B$11:$L$123,G9)","v":-1.9514478098680115E-5},-2.1920624745662948E-5,-2.0717029739567765E-4,1.0497370948824986E-5,-6.5786963446551878E-5,4.7667828062998083E-5,null,"check on first derivatives",null,null,null,null,null,null,null,null,null,"s.e. t(1)",{"$f":"SQRT(MMULT(TRANSPOSE(Y3:Y5),MMULT(N2:P4,Y3:Y5)))","v":1.9157117565936799},null,null,"EXP(2f2)*NORMSDIST(-2f)",{"$f":"(b_1*fT+b_2*fT^2+b_3*fT^3+b_4*fT^4+b_5*fT^5)/SQRT(2*PI())","v":0.14869931085753385}]
[null,null,null,"First derivatives of G(ti)",null,null,6,7,8,9,10,11,null,{"$f":"SUMPRODUCT($C12:$C123,N12:N123)+N11","v":-3.9413373789010508},{"$f":"SUMPRODUCT($C12:$C123,O12:O123)+O11","v":-7.5777098593799927E-2},{"$f":"SUMPRODUCT($C12:$C123,P12:P123)+P11","v":-0.30830298477089313},"should be 0"]
["G(ti)","ti","ni","lag","l","m","lag, lag","l, l","m, m","lag, l","lag, m","l, m","working","lag","l","m","lag, lag","l, l","m, m","lag, l","lag, m","l, m"]
[{"$f":"Data!I10","v":0},{"$f":"IF(Data!B10=\"\",\"\",Data!B10)","v":32},{"$f":"IF(Data!C10=\"\",\"\",Data!C10)","v":0},{"$f":"-1*PDF(B11,Mu,lag,scale)","v":0},{"$f":"IF(B11<=lag,0,EXP(-0.5*scale/(B11-lag)*((B11-lag-Mu)/Mu)^2)/SQRT(2*PI())*(-1/SQRT(scale*(B11-lag))+2/Mu*(0.31938153*$M11-0.356563782*$M11^2+1.781477937*$M11^3-1.821255978*$M11^4+1.330274429*$M11^5)))","v":0},{"$f":"IF(B11<=lag,0,EXP(-0.5*scale/(B11-lag)*((B11-lag-Mu)/Mu)^2)/SQRT(2*PI())*(-2*scale/Mu^2*(0.31938153*$M11-0.356563782*$M11^2+1.781477937*$M11^3-1.821255978*$M11^4+1.330274429*$M11^5)))","v":0},null,null,null,null,null,null,null,{"$f":"-1*g*D8/Gtk","v":5.9666459152060286E-2},{"$f":"-1*g*E8/Gtk","v":-6.4652473977457908E-2},{"$f":"-1*g*F8/Gtk","v":0.30259205505765141},null,null,null,null,null,null,null,"t50 iterations"]
[{"$f":"Data!I11","v":4.0019421012000555E-5},{"$f":"IF(Data!B11=\"\",\"\",Data!B11)","v":55},{"$f":"IF(Data!C11=\"\",\"\",Data!C11)","v":1},{"$f":"IF(B12=\"\",\"\",-1*PDF(B12,Mu,lag,scale))","v":-1.8837918620089253E-4},{"$f":"IF(B12=\"\",\"\",IF(B12<lag,0,EXP(-0.5*scale/(B12-lag)*((B12-lag-Mu)/Mu)^2)/SQRT(2*PI())*(-1/SQRT(scale*(B12-lag))+2/Mu*(0.31938153*$M12-0.356563782*$M12^2+1.781477937*$M12^3-1.821255978*$M12^4+1.330274429*$M12^5))))","v":-8.5268643122786228E-6},{"$f":"IF(B12=\"\",\"\",IF(B12<lag,0,EXP(-0.5*scale/(B12-lag)*((B12-lag-Mu)/Mu)^2)/SQRT(2*PI())*(-2*scale/Mu^2*(0.31938153*$M12-0.356563782*$M12^2+1.781477937*$M12^3-1.821255978*$M12^4+1.330274429*$M12^5))))","v":-1.7239269201808419E-6},{"$f":"IF(B12=\"\",\"\",IF(B12<lag,0,-1*SQRT(scale/(2*PI()*(B12-lag)^7))/(2*Mu^2)*(3*Mu^2*(B12-lag)+scale*((B12-lag)^2-Mu^2))*EXP(-0.5*scale*(B12-lag-Mu)^2/((B12-lag)*Mu^2))))","v":6.6193193623459966E-4},{"$f":"IF(B12=\"\",\"\",IF(B12<lag,0,EXP(-0.5*scale/(B12-lag)*((B12-lag-Mu)/Mu)^2)/SQRT(2*PI())*(1/(2*SQRT(scale^3*(B12-lag)))-((B12-lag)^2+4*(B12-lag)*Mu-Mu^2)/(2*Mu^2*SQRT(scale*(B12-lag)^3))+4/Mu^2*(0.31938153*$M12-0.356563782*$M12^2+1.781477937*$M12^3-1.821255978*$M12^4+1.330274429*$M12^5))))","v":1.6959945449210042E-6},{"$f":"IF(B12=\"\",\"\",IF(B12<lag,0,EXP(-0.5*scale/(B12-lag)*((B12-lag-Mu)/Mu)^2)/SQRT(2*PI())*(-2*SQRT(scale^3*(B12-lag))+4*scale*(scale+Mu)*(0.31938153*$M12-0.356563782*$M12^2+1.781477937*$M12^3-1.821255978*$M12^4+1.330274429*$M12^5))/Mu^4))","v":1.7226059194612784E-7},{"$f":"IF(B12=\"\",\"\",IF(B12<lag,0,EXP(-0.5*scale/(B12-lag)*((B12-lag-Mu)/Mu)^2)/SQRT(2*PI())*(scale*(B12-lag-Mu)^2-Mu^2*(B12-lag))/(2*Mu^2*SQRT(scale*(B12-lag)^5))))","v":3.3184770813531282E-5},{"$f":"IF(B12=\"\",\"\",IF(B12<lag,0,-1*SQRT(scale^3/(2*PI()*(B12-lag)^3))*((B12-lag-Mu)/Mu^3)*EXP(-0.5*(scale/(B12-lag))*((B12-lag-Mu)/Mu)^2)))","v":7.4736776174203237E-6},{"$f":"IF(B12=\"\",\"\",IF(B12<lag,0,EXP(-0.5*scale/(B12-lag)*((B12-lag-Mu)/Mu)^2)/SQRT(2*PI())*(SQRT(scale/(B12-lag))*(B12-lag+Mu)/Mu^3-2/Mu^2*(1+2*scale/Mu)*(0.31938153*$M12-0.356563782*$M12^2+1.781477937*$M12^3-1.821255978*$M12^4+1.330274429*$M12^5))))","v":3.0170898650202022E-7},{"$f":"IF(B12=\"\",\"\",IF(B12<lag,0,1/(1+0.2316419*SQRT(scale/(B12-lag))*(B12-lag+Mu)/Mu)))","v":0.47864005514590913},{"$f":"IF(B12=\"\",\"\",IF(B12<lag,0,(D12-D11)/($A12-$A11)))","v":-4.7071941931494612},{"$f":"IF(C12=\"\",\"\",IF(B12<lag,0,(E12-E11)/($A12-$A11)))","v":-0.21306815782571384},{"$f":"IF(D12=\"\",\"\",IF(B12<lag,0,(F12-F11)/($A12-$A11)))","v":-4.3077257905952487E-2},{"$f":"IF(D12=\"\",\"\",IF(B12<lag,0,(G12-G11)/($A12-$A11)-(D12-D11)^2/($A12-$A11)^2))","v":-5.6174094845862612},{"$f":"IF(E12=\"\",\"\",IF(B12<lag,0,(H12-H11)/($A12-$A11)-(E12-E11)^2/($A12-$A11)^2))","v":-3.0187524724507517E-3},{"$f":"IF(F12=\"\",\"\",IF(B12<lag,0,(I12-I11)/($A12-$A11)-(F12-F11)^2/($A12-$A11)^2))","v":2.4487747427704336E-3},{"$f":"IF(G12=\"\",\"\",IF(B12<lag,0,(J12-J11)/($A12-$A11)-(D12-D11)*(E12-E11)/($A12-$A11)^2))","v":-0.17373653059386063},{"$f":"IF(G12=\"\",\"\",IF(B12<lag,0,(K12-K11)/($A12-$A11)-(D12-D11)*(F12-F11)/($A12-$A11)^2))","v":-1.60217503016023E-2},{"$f":"IF(G12=\"\",\"\",IF(B12<lag,0,(L12-L11)/($A12-$A11)-(E12-E11)*(F12-F11)/($A12-$A11)^2))","v":-1.639327730088732E-3},null,"t(1)",{"$f":"lag+Mu-SQRT(2*PI()/scale)*Mu^1.5*ff","v":74.668363535046964}]
[{"$f":"Data!I12","v":9.1652259360676086E-2},{"$f":"IF(Data!B12=\"\",\"\",Data!B12)","v":62},{"$f":"IF(Data!C12=\"\",\"\",Data!C12)","v":7},-2.8067084820173949E-2,{"$f":"IF(B13=\"\",\"\",IF(B13<lag,0,EXP(-0.5*scale/(B13-lag)*((B13-lag-Mu)/Mu)^2)/SQRT(2*PI())*(-1/SQRT(scale*(B13-lag))+2/Mu*(0.31938153*$M13-0.356563782*$M13^2+1.781477937*$M13^3-1.821255978*$M13^4+1.330274429*$M13^5))))","v":-3.503272245231363E-3},{"$f":"IF(B13=\"\",\"\",IF(B13<lag,0,EXP(-0.5*scale/(B13-lag)*((B13-lag-Mu)/Mu)^2)/SQRT(2*PI())*(-2*scale/Mu^2*(0.31938153*$M13-0.356563782*$M13^2+1.781477937*$M13^3-1.821255978*$M13^4+1.330274429*$M13^5))))","v":-3.2862491976884118E-3},{"$f":"IF(B13=\"\",\"\",IF(B13<lag,0,-1*SQRT(scale/(2*PI()*(B13-lag)^7))/(2*Mu^2)*(3*Mu^2*(B13-lag)+scale*((B13-lag)^2-Mu^2))*EXP(-0.5*scale*(B13-lag-Mu)^2/((B13-lag)*Mu^2))))","v":2.0617900806233708E-3},{"$f":"IF(B13=\"\",\"\",IF(B13<lag,0,EXP(-0.5*scale/(B13-lag)*((B13-lag-Mu)/Mu)^2)/SQRT(2*PI())*(1/(2*SQRT(scale^3*(B13-lag)))-((B13-lag)^2+4*(B13-lag)*Mu-Mu^2)/(2*Mu^2*SQRT(scale*(B13-lag)^3))+4/Mu^2*(0.31938153*$M13-0.356563782*$M13^2+1.781477937*$M13^3-1.821255978*$M13^4+1.330274429*$M13^5))))","v":1.3925493050339838E-4},{"$f":"IF(B13=\"\",\"\",IF(B13<lag,0,EXP(-0.5*scale/(B13-lag)*((B13-lag-Mu)/Mu)^2)/SQRT(2*PI())*(-2*SQRT(scale^3*(B13-lag))+4*scale*(scale+Mu)*(0.31938153*$M13-0.356563782*$M13^2+1.781477937*$M13^3-1.821255978*$M13^4+1.330274429*$M13^5))/Mu^4))","v":2.8487057864202552E-4},{"$f":"IF(B13=\"\",\"\",IF(B13<lag,0,EXP(-0.5*scale/(B13-lag)*((B13-lag-Mu)/Mu)^2)/SQRT(2*PI())*(scale*(B13-lag-Mu)^2-Mu^2*(B13-lag))/(2*Mu^2*SQRT(scale*(B13-lag)^5))))","v":4.4646259804000219E-4},{"$f":"IF(B13=\"\",\"\",IF(B13<lag,0,-1*SQRT(scale^3/(2*PI()*(B13-lag)^3))*((B13-lag-Mu)/Mu^3)*EXP(-0.5*(scale/(B13-lag))*((B13-lag-Mu)/Mu)^2)))","v":8.5284071157183694E-4},{"$f":"IF(B13=\"\",\"\",IF(B13<lag,0,EXP(-0.5*scale/(B13-lag)*((B13-lag-Mu)/Mu)^2)/SQRT(2*PI())*(SQRT(scale/(B13-lag))*(B13-lag+Mu)/Mu^3-2/Mu^2*(1+2*scale/Mu)*(0.31938153*$M13-0.356563782*$M13^2+1.781477937*$M13^3-1.821255978*$M13^4+1.330274429*$M13^5))))","v":4.6149334729517638E-5},{"$f":"IF(B13=\"\",\"\",IF(B13<lag,0,1/(1+0.2316419*SQRT(scale/(B13-lag))*(B13-lag+Mu)/Mu)))","v":0.60547531809712418},{"$f":"IF(B13=\"\",\"\",IF(B13<lag,0,(D13-D12)/($A13-$A12)))","v":-0.30431201826670762},{"$f":"IF(C13=\"\",\"\",IF(B13<lag,0,(E13-E12)/($A13-$A12)))","v":-3.8147144783499752E-2},{"$f":"IF(D13=\"\",\"\",IF(B13<lag,0,(F13-F12)/($A13-$A12)))","v":-3.5852472037922259E-2},{"$f":"IF(D13=\"\",\"\",IF(B13<lag,0,(G13-G12)/($A13-$A12)-(D13-D12)^2/($A13-$A12)^2))","v":-7.7325552114155371E-2},{"$f":"IF(E13=\"\",\"\",IF(B13<lag,0,(H13-H12)/($A13-$A12)-(E13-E12)^2/($A13-$A12)^2))","v":4.6329812849084384E-5},{"$f":"IF(F13=\"\",\"\",IF(B13<lag,0,(I13-I12)/($A13-$A12)-(F13-F12)^2/($A13-$A12)^2))","v":1.8222452341735032E-3},{"$f":"IF(G13=\"\",\"\",IF(B13<lag,0,(J13-J12)/($A13-$A12)-(D13-D12)*(E13-E12)/($A13-$A12)^2))","v":-7.097470746239825E-3},{"$f":"IF(G13=\"\",\"\",IF(B13<lag,0,(K13-K12)/($A13-$A12)-(D13-D12)*(F13-F12)/($A13-$A12)^2))","v":-1.6826734106991995E-3},{"$f":"IF(G13=\"\",\"\",IF(B13<lag,0,(L13-L12)/($A13-$A12)-(E13-E12)*(F13-F12)/($A13-$A12)^2))","v":-8.6721638242191344E-4},{"$f":"ABS(Y12-Y13)","v":1.7911793698974492},"t(2)",{"$f":"Y12-(IG(lag,Y12,Mu,lag,scale)-0.5)/PDF(Y12,Mu,lag,scale)","v":76.459542904944414}]
[{"$f":"Data!I13","v":0.36421545945301947},{"$f":"IF(Data!B13=\"\",\"\",Data!B13)","v":72},{"$f":"IF(Data!C13=\"\",\"\",Data!C13)","v":27},-2.6048272245950934E-2,-3.8612917429791888E-3,-1.0299881726166396E-2,-1.0319040285289712E-3,7.6623671054889853E-5,7.2026357550855635E-4,-1.8566447735159791E-4,4.4588198033288271E-4,-9.6786706445232192E-5,0.64049061934026918,7.406768681682079E-3,-1.3135283766353277E-3,-2.5732133046947617E-2,-1.1405233670018862E-2,-2.3151154740188871E-4,9.3525931385810967E-4,-2.3094655022210852E-3,-1.3024882939513503E-3,-5.5821419205766179E-4,{"$f":"ABS(Y13-Y14)","v":7.4997898352762604E-2},"t(3)",76.534540803297176]
[{"$f":"Data!I14","v":0.51038763263703624},{"$f":"IF(Data!B14=\"\",\"\",Data!B14)","v":79},{"$f":"IF(Data!C14=\"\",\"\",Data!C14)","v":22},-1.9138388213621273E-2,-2.4196334668804761E-3,-1.2302196861006037E-2,-8.8748874423764533E-4,4.9856529287672615E-5,7.2440146312074212E-4,-2.0377839772020112E-4,1.4984855094538234E-4,-1.5988577999649086E-4,0.6467499848545557,4.7272226182412842E-2,9.8627409355390994E-3,-1.369833321366111E-2,-1.246682679813443E-3,-2.8039429782820215E-4,-1.5933601995698525E-4,-5.9015553094014979E-4,-1.3776872236234382E-3,-2.9657326124892327E-4,{"$f":"ABS(Y14-Y15)","v":1.2723647530776816E-4},"t(4)",76.534668039772484]
{"$rows_left_out":108}